Ubuntu 14.04 - Sleuthkit make Errors

Tool requests, development, and troubleshooting topics related to TSK.

Moderator: carrier

Ubuntu 14.04 - Sleuthkit make Errors

Postby Hoyt » Thu May 12, 2016 8:55 pm

I'm building tsk from source (sleuthkit-4.2.0) on Ubuntu 14.04.4 64-bit with afflib (libewf-experimental-20160424 with Python bindings) and libewf (AFFLIB Version 3.7.7) support. It configures without error based on the following:

Code: Select all
configure:
Building:
   afflib support:                       yes
   libewf support:                      yes
   zlib support:                          yes

Features:
   Java/JNI support:                  yes


When I run make, I get the following error:

Code: Select all
make[2]: Entering directory `/home/hharness/bin/Autopsy4/sleuthkit/tools/imgtools'
g++ -DHAVE_CONFIG_H -I. -I../../tsk  -I../.. -I./../.. -Wall -pthread -I/usr/local/include -I/home/hharness/bin/Autopsy4/tsk/include -I/home/hharness/bin/Autopsy4/tsk/include  -g -O2 -MT img_cat.o -MD -MP -MF .deps/img_cat.Tpo -c -o img_cat.o img_cat.cpp
mv -f .deps/img_cat.Tpo .deps/img_cat.Po
/bin/bash ../../libtool  --tag=CXX   --mode=link g++  -g -O2  -pthread -L/usr/local/lib -L/home/hharness/bin/Autopsy4/tsk/lib -L/home/hharness/bin/Autopsy4/tsk/lib -static -o img_cat img_cat.o ../../tsk/libtsk.la -lewf -ldl -lz -lafflib -ldl -lstdc++
libtool: link: g++ -g -O2 -pthread -o img_cat img_cat.o  -L/usr/local/lib -L/home/hharness/bin/Autopsy4/tsk/lib ../../tsk/.libs/libtsk.a /usr/local/lib/libewf.so -lpthread -lbz2 /usr/local/lib/libafflib.so -lcrypto /usr/lib/x86_64-linux-gnu/libexpat.so -ltermcap -lrt -lz -lreadline -ldl -lstdc++ -pthread
../../tsk/.libs/libtsk.a(ewf.o): In function `ewf_image_read':
/home/hharness/bin/Autopsy4/sleuthkit/tsk/img/ewf.c:69: undefined reference to `libewf_handle_read_random'
collect2: error: ld returned 1 exit status
make[2]: *** [img_cat] Error 1
make[2]: Leaving directory `/home/hharness/bin/Autopsy4/sleuthkit/tools/imgtools'
make[1]: *** [all-recursive] Error 1
make[1]: Leaving directory `/home/hharness/bin/Autopsy4/sleuthkit/tools'
make: *** [all-recursive] Error 1


Any ideas?

Hoyt
Hoyt Harness, CFCE
Hoyt
 
Posts: 73
Joined: Thu Dec 11, 2014 4:02 am
Location: Little Rock, AR

Re: Ubuntu 14.04 - Sleuthkit make Errors

Postby Hoyt » Thu May 12, 2016 9:17 pm

If worse comes to worst, I can drop back to libewf v.20130128 as the tsk docs recommend, but where can I get this version? It's not one of the Github releases under libyal/libewf or the older releases. I can't seem to find it anywhere.
Hoyt Harness, CFCE
Hoyt
 
Posts: 73
Joined: Thu Dec 11, 2014 4:02 am
Location: Little Rock, AR

Re: Ubuntu 14.04 - Sleuthkit make Errors

Postby Hoyt » Thu May 12, 2016 9:20 pm

Found it here.
Hoyt Harness, CFCE
Hoyt
 
Posts: 73
Joined: Thu Dec 11, 2014 4:02 am
Location: Little Rock, AR


Return to The Sleuth Kit (TSK)

Who is online

Users browsing this forum: No registered users and 1 guest

cron